{"text_format":"1","workbook":"xlsx","n_sheets":6,"sheets":["Anleitung","Instructions","Eingabeblatt","Ausgabeblatt","Berechnung_Male","Berechnung_Female"],"not_rendered":{"charts":0,"images":2,"macros":1,"external_links":0,"defined_names":0,"comments":0,"pivot_tables":0},"unopened":[],"bounds":{"document_bytes":16777216,"sheet_cells":100000,"rows_first":2000,"rows_last":500,"rows_between":2000,"halvings":0,"cell_chars":16384,"cell_head_chars":4096},"cells_cut":0,"cells_raw":0,"read":"whole","date_system":"1900"}

{"sheet":"Anleitung","index":0,"n_rows":48,"n_cols":4,"rows_kept":48,"cut":false,"hidden":false,"merged":[]}
[]
[null,"Anleitung zum Mirwald-Test zur Bestimmung des biologischen Entwicklungsstandes bei Mädchen und Knaben"]
[]
[null,"Stichwortartige Zusammenfassung des Testprotokolls"]
[]
[null," Körpergewicht bestimmen"]
[null,null,"1.","Kalibrierte Waage verwenden – Nullmessung überprüfen"]
[null,null,"2.","Athlet/in mittig auf Waage, Gewicht auf beide Füsse gleichmässig verteilt"]
[null,null,"3.","Messung auf 0.1 kg genau"]
[null,null,"4.","Erneute Durchführung der Schritte 1 bis 3"]
[null,null,"5.","Falls Unterschied zw. 1. und 2. Messung kleiner als 0.4 kg, dann Durchschnitt als Ergebnis verwenden."]
[null,null,null,"Falls Unterschied grösser ist als 0.4 kg, dann wieder bei Punkt 1 beginnen."]
[]
[null,"Körpergrösse stehend"]
[null,null,"(in „gestreckter“ Haltung – maximale Distanz zwischen Boden und Scheitel des Kopfes. "]
[null,null,"Der Scheitel gilt dabei als höchster Punkt des Schädels, wenn der Kopf exakt horizontal gehalten wird)."]
[]
[null,null,"1.","Athlet/in steht mit Rücken, Gesäss und Fersen gegen die Wand. Füsse sind zusammen und flach auf dem Boden."]
[null,null,"2.","Kopf / Blick horizontal ausrichten."]
[null,null,"3.","Athlet/in atmet möglichst tief ein und hält den Atem an."]
{"$rows_left_out":29}
{"sheet":"Instructions","index":1,"n_rows":48,"n_cols":4,"rows_kept":48,"cut":false,"hidden":false,"merged":[]}
[]
[null,"Test Mirwald pour la détermination de l’état de développement biologique des garçons et des filles: guide de réalisation"]
[]
[null,"Le protocole de test en bref"]
[]
[null,"Poids corporel"]
[null,null,"1.","Utiliser une balance calibrée. Contrôler le zéro."]
[null,null,"2."," L’athlète doit se placer au milieu de la balance, son poids réparti équitablement sur ses deux pieds."]
[null,null,"3.","Mesurer le poids à 0,1 kg près."]
[null,null,"4.","Répéter les étapes 1 à 3."]
[null,null,"5.","Si les deux résultats divergent de moins de 0,4 kg, le résultat pris en compte sera la moyenne des deux valeurs. "]
[null,null,null,"Si l’écart entre les deux résultats est supérieur à 0,4 kg, recommencer à l’étape 1. "]
[]
[null,"Taille debout "]
[null,null,"(à mesurer en position «étendue», c’est-à-dire avec une distance maximale entre le sol et le sommet de la tête."]
[null,null,"Sommet de la tête = point du crâne le plus haut lorsque la tête est tenue exactement à l’horizontale)."]
[]
[null,null,"1.","L’athlète est debout, adossé au mur. Son dos, ses fesses et ses talons doivent toucher le mur. Ses pieds sont joints et posés à plat sur le sol."]
[null,null,"2.","Tête / regard à l’horizontale."]
[null,null,"3.","L’athlète inspire aussi profondément que possible et bloque sa respiration."]
{"$rows_left_out":29}
{"sheet":"Eingabeblatt","index":2,"n_rows":500,"n_cols":29,"rows_kept":500,"cut":false,"hidden":false,"merged":[]}
[]
[]
[]
["Geschlecht\nm = male / f = female\n\nSexe\nm = homme /  f = femme","Messdatum\n\n\nDate de la mesure","Name\n\n\nNom","Vorname\n\n\nPrénom","Geburtsdatum\n(tt.mm.jjjj)\n\nDate de naissance\n(jj.mm.aaaa)","Körpergewicht auf der Waage (Kg)\n\nPoids sur la balance (kg)\n\n","Gewicht Kleidung (Kg)\n\n\npoids des habits (kg)","Effektives Gewicht (Kg)\n\nPoids effectif (kg)","Körpergrösse stehend (cm)\n\nTaille debout (cm)","Körpergrösse sitzend (cm) inkl. Sitzhöhe\n\nTaille assise inclus support (cm)","Stuhl/PlyoBox… höhe (cm)\n\nhauteur de la chaise, de la box,… (cm)","Körpergrösse sitzend (cm)\n\nTaille assise (cm)","Beinlänge (cm)\n\n\nLongueur des jambes (cm)","aktuelles chronologisches Alter\n\nÂge chronologique actuel","Geschätztes Alter beim Wachstumsspurt\n\nÂge estimé au pic de croissance","Reifestand\n\n\nEtat de maturité","Biologischer Entwicklungsstand\n\nEtat de développement biologique","Bio. Entwicklungsstand\nZahl (1-3)\n\nEtat de développement biologique\nCatégorie 1-3","BES Zahl (1-5)\nDév. bio. Catégorie 1-5","BES Zahl (1-5)\nDév. Bio Catégorie 1-5","Geschätzte Erwachsenegrösse ( ± 5.4cm)\n\nTaille estimée à l'âge adulte\n( ± 5.4cm)","Geschätzte Wachstumsreserve (cm)\n\nRéserve de croissance estimée (cm)","Prozent Erwachsenengrösse\n\n\nPourcentage de la taille adulte atteinte actuellement",null,null,null,"Spaltenangabe Tabelle"]
[null,null,null,null,null,null,null,{"$f":"F5-G5","v":0},null,null,null,{"$f":"J5-K5","v":0},{"$f":"I5-L5","v":0},{"$f":"(B5-E5)/365.25","v":0},{"$f":"N5-P5","v":{"$error":"#DIV/0!"}},{"$f":"IF(A5=\"m\",(-9.236+(0.0002708*M5*L5)+(-0.001663*N5*M5)+(0.007216*N5*L5)+(0.02292*F5/I5*100)),(-9.376+(0.0001882*M5*L5)+(0.0022*N5*M5)+(0.005841*N5*L5)-(0.002658*N5*F5)+(0.07693*(F5/I5)*100)))","v":{"$error":"#DIV/0!"}},{"$f":"IF(R5=1,\"Früh / précoce\",IF(R5=2,\"Durchschnittlich / Normal\",\"Spät / Tardif\"))","v":{"$error":"#DIV/0!"}},{"$f":"IF(A5=\"m\",(IF(O5<12.8,1,IF(O5>14.8,3,2))),(IF(O5<11,1,IF(O5>13,3,2))))","v":{"$error":"#DIV/0!"}},{"$f":"IF(A5=\"m\",(IF(O5<12.8,1,IF(O5<13.3,2,IF(O5>14.8,5,IF(O5>14.3,4,3))))),(IF(O5<11,1,IF(O5<11.5,2,IF(O5>13,5,IF(O5>12.5,4,3))))))","v":{"$error":"#DIV/0!"}},{"$f":"IF(S5=1,\"Früh / précoce\",IF(S5=2,\"Möglicherweise Früh / éventuellement précoce\", IF(S5=3,\"Durchschnittlich / Normal\",IF(S5=4,\"Möglicherweise spät / éventuellement tardif\",\"Spät / Tardif\"))))","v":{"$error":"#DIV/0!"}},{"$f":"I5+V5","v":{"$error":"#DIV/0!"}},{"$f":"IF(A5=\"m\",VLOOKUP(P5,Berechnung_Male!$A$1:$D$42,AA5,TRUE),VLOOKUP(Eingabeblatt!P5,Berechnung_Female!$A$1:$D$42,AA5,TRUE))","v":{"$error":"#DIV/0!"}},{"$f":"I5/U5","v":{"$error":"#DIV/0!"}},null,null,null,{"$f":"IF(A5=\"m\",IF(O5<12.8,2,IF(O5<14.8,3,4)),IF(O5<11,2,IF(O5<13,3,4)))","v":{"$error":"#DIV/0!"}},null,"m"]
[null,null,null,null,null,null,null,{"$f":"F6-G6","v":0},null,null,null,{"$f":"J6-K6","v":0},{"$f":"I6-J6","v":0},{"$f":"(B6-E6)/365.25","v":0},{"$f":"N6-P6","v":{"$error":"#DIV/0!"}},{"$f":"IF(A6=\"m\",(-9.236+(0.0002708*M6*J6)+(-0.001663*N6*M6)+(0.007216*N6*J6)+(0.02292*F6/I6*100)),(-9.376+(0.0001882*M6*J6)+(0.0022*N6*M6)+(0.005841*N6*J6)-(0.002658*N6*F6)+(0.07693*(F6/I6)*100)))","v":{"$error":"#DIV/0!"}},{"$f":"IF(R6=1,\"Früh / précoce\",IF(R6=2,\"Durchschnittlich / Normal\",\"Spät / Tardif\"))","v":{"$error":"#DIV/0!"}},{"$f":"IF(A6=\"m\",(IF(O6<12.8,1,IF(O6>14.8,3,2))),(IF(O6<11,1,IF(O6>13,3,2))))","v":{"$error":"#DIV/0!"}},{"$error":"#DIV/0!"},{"$f":"IF(S6=1,\"Früh / précoce\",IF(S6=2,\"Möglicherweise Früh / éventuellement précoce\", IF(S6=3,\"Durchschnittlich / Normal\",IF(S6=4,\"Möglicherweise spät / éventuellement tardif\",\"Spät / Tardif\"))))","v":{"$error":"#DIV/0!"}},{"$error":"#DIV/0!"},{"$f":"IF(A6=\"m\",VLOOKUP(P6,Berechnung_Male!$A$1:$D$42,AA6,TRUE),VLOOKUP(Eingabeblatt!P6,Berechnung_Female!$A$1:$D$42,AA6,TRUE))","v":{"$error":"#DIV/0!"}},{"$error":"#DIV/0!"},null,null,null,{"$error":"#DIV/0!"},null,"f"]
[null,null,null,null,null,null,null,{"$f":"F7-G7","v":0},null,null,null,0,0,0,{"$error":"#DIV/0!"},{"$error":"#DIV/0!"},{"$error":"#DIV/0!"},{"$error":"#DIV/0!"},{"$error":"#DIV/0!"},{"$error":"#DIV/0!"},{"$error":"#DIV/0!"},{"$f":"IF(A7=\"m\",VLOOKUP(P7,Berechnung_Male!$A$1:$D$42,AA7,TRUE),VLOOKUP(Eingabeblatt!P7,Berechnung_Female!$A$1:$D$42,AA7,TRUE))","v":{"$error":"#DIV/0!"}},{"$error":"#DIV/0!"},null,null,null,{"$error":"#DIV/0!"}]
[null,null,null,null,null,null,null,0,null,null,null,0,0,0,{"$error":"#DIV/0!"},{"$error":"#DIV/0!"},{"$error":"#DIV/0!"},{"$error":"#DIV/0!"},{"$error":"#DIV/0!"},{"$error":"#DIV/0!"},{"$error":"#DIV/0!"},{"$f":"IF(A8=\"m\",VLOOKUP(P8,Berechnung_Male!$A$1:$D$42,AA8,TRUE),VLOOKUP(Eingabeblatt!P8,Berechnung_Female!$A$1:$D$42,AA8,TRUE))","v":{"$error":"#DIV/0!"}},{"$error":"#DIV/0!"},null,null,null,{"$error":"#DIV/0!"}]
[null,null,null,null,null,null,null,0,null,null,null,0,0,0,{"$error":"#DIV/0!"},{"$error":"#DIV/0!"},{"$error":"#DIV/0!"},{"$error":"#DIV/0!"},{"$error":"#DIV/0!"},{"$error":"#DIV/0!"},{"$error":"#DIV/0!"},{"$f":"IF(A9=\"m\",VLOOKUP(P9,Berechnung_Male!$A$1:$D$42,AA9,TRUE),VLOOKUP(Eingabeblatt!P9,Berechnung_Female!$A$1:$D$42,AA9,TRUE))","v":{"$error":"#DIV/0!"}},{"$error":"#DIV/0!"},null,null,null,{"$error":"#DIV/0!"}]
[null,null,null,null,null,null,null,0,null,null,null,0,0,0,{"$error":"#DIV/0!"},{"$error":"#DIV/0!"},{"$error":"#DIV/0!"},{"$error":"#DIV/0!"},{"$error":"#DIV/0!"},{"$error":"#DIV/0!"},{"$error":"#DIV/0!"},{"$f":"IF(A10=\"m\",VLOOKUP(P10,Berechnung_Male!$A$1:$D$42,AA10,TRUE),VLOOKUP(Eingabeblatt!P10,Berechnung_Female!$A$1:$D$42,AA10,TRUE))","v":{"$error":"#DIV/0!"}},{"$error":"#DIV/0!"},null,null,null,{"$error":"#DIV/0!"}]
[null,null,null,null,null,null,null,0,null,null,null,0,0,0,{"$error":"#DIV/0!"},{"$error":"#DIV/0!"},{"$error":"#DIV/0!"},{"$error":"#DIV/0!"},{"$error":"#DIV/0!"},{"$error":"#DIV/0!"},{"$error":"#DIV/0!"},{"$f":"IF(A11=\"m\",VLOOKUP(P11,Berechnung_Male!$A$1:$D$42,AA11,TRUE),VLOOKUP(Eingabeblatt!P11,Berechnung_Female!$A$1:$D$42,AA11,TRUE))","v":{"$error":"#DIV/0!"}},{"$error":"#DIV/0!"},null,null,null,{"$error":"#DIV/0!"}]
[null,null,null,null,null,null,null,0,null,null,null,0,0,0,{"$error":"#DIV/0!"},{"$error":"#DIV/0!"},{"$error":"#DIV/0!"},{"$error":"#DIV/0!"},{"$error":"#DIV/0!"},{"$error":"#DIV/0!"},{"$error":"#DIV/0!"},{"$f":"IF(A12=\"m\",VLOOKUP(P12,Berechnung_Male!$A$1:$D$42,AA12,TRUE),VLOOKUP(Eingabeblatt!P12,Berechnung_Female!$A$1:$D$42,AA12,TRUE))","v":{"$error":"#DIV/0!"}},{"$error":"#DIV/0!"},null,null,null,{"$error":"#DIV/0!"}]
[null,null,null,null,null,null,null,0,null,null,null,0,0,0,{"$error":"#DIV/0!"},{"$error":"#DIV/0!"},{"$error":"#DIV/0!"},{"$error":"#DIV/0!"},{"$error":"#DIV/0!"},{"$error":"#DIV/0!"},{"$error":"#DIV/0!"},{"$f":"IF(A13=\"m\",VLOOKUP(P13,Berechnung_Male!$A$1:$D$42,AA13,TRUE),VLOOKUP(Eingabeblatt!P13,Berechnung_Female!$A$1:$D$42,AA13,TRUE))","v":{"$error":"#DIV/0!"}},{"$error":"#DIV/0!"},null,null,null,{"$error":"#DIV/0!"}]
[null,null,null,null,null,null,null,0,null,null,null,0,0,0,{"$error":"#DIV/0!"},{"$error":"#DIV/0!"},{"$error":"#DIV/0!"},{"$error":"#DIV/0!"},{"$error":"#DIV/0!"},{"$error":"#DIV/0!"},{"$error":"#DIV/0!"},{"$f":"IF(A14=\"m\",VLOOKUP(P14,Berechnung_Male!$A$1:$D$42,AA14,TRUE),VLOOKUP(Eingabeblatt!P14,Berechnung_Female!$A$1:$D$42,AA14,TRUE))","v":{"$error":"#DIV/0!"}},{"$error":"#DIV/0!"},null,null,null,{"$error":"#DIV/0!"}]
[null,null,null,null,null,null,null,0,null,null,null,0,0,0,{"$error":"#DIV/0!"},{"$error":"#DIV/0!"},{"$error":"#DIV/0!"},{"$error":"#DIV/0!"},{"$error":"#DIV/0!"},{"$error":"#DIV/0!"},{"$error":"#DIV/0!"},{"$f":"IF(A15=\"m\",VLOOKUP(P15,Berechnung_Male!$A$1:$D$42,AA15,TRUE),VLOOKUP(Eingabeblatt!P15,Berechnung_Female!$A$1:$D$42,AA15,TRUE))","v":{"$error":"#DIV/0!"}},{"$error":"#DIV/0!"},null,null,null,{"$error":"#DIV/0!"}]
[null,null,null,null,null,null,null,0,null,null,null,0,0,0,{"$error":"#DIV/0!"},{"$error":"#DIV/0!"},{"$error":"#DIV/0!"},{"$error":"#DIV/0!"},{"$error":"#DIV/0!"},{"$error":"#DIV/0!"},{"$error":"#DIV/0!"},{"$f":"IF(A16=\"m\",VLOOKUP(P16,Berechnung_Male!$A$1:$D$42,AA16,TRUE),VLOOKUP(Eingabeblatt!P16,Berechnung_Female!$A$1:$D$42,AA16,TRUE))","v":{"$error":"#DIV/0!"}},{"$error":"#DIV/0!"},null,null,null,{"$error":"#DIV/0!"}]
[null,null,null,null,null,null,null,0,null,null,null,0,0,0,{"$error":"#DIV/0!"},{"$error":"#DIV/0!"},{"$error":"#DIV/0!"},{"$error":"#DIV/0!"},{"$error":"#DIV/0!"},{"$error":"#DIV/0!"},{"$error":"#DIV/0!"},{"$f":"IF(A17=\"m\",VLOOKUP(P17,Berechnung_Male!$A$1:$D$42,AA17,TRUE),VLOOKUP(Eingabeblatt!P17,Berechnung_Female!$A$1:$D$42,AA17,TRUE))","v":{"$error":"#DIV/0!"}},{"$error":"#DIV/0!"},null,null,null,{"$error":"#DIV/0!"}]
[null,null,null,null,null,null,null,0,null,null,null,0,0,0,{"$error":"#DIV/0!"},{"$error":"#DIV/0!"},{"$error":"#DIV/0!"},{"$error":"#DIV/0!"},{"$error":"#DIV/0!"},{"$error":"#DIV/0!"},{"$error":"#DIV/0!"},{"$f":"IF(A18=\"m\",VLOOKUP(P18,Berechnung_Male!$A$1:$D$42,AA18,TRUE),VLOOKUP(Eingabeblatt!P18,Berechnung_Female!$A$1:$D$42,AA18,TRUE))","v":{"$error":"#DIV/0!"}},{"$error":"#DIV/0!"},null,null,null,{"$error":"#DIV/0!"}]
[null,null,null,null,null,null,null,0,null,null,null,0,0,0,{"$error":"#DIV/0!"},{"$error":"#DIV/0!"},{"$error":"#DIV/0!"},{"$error":"#DIV/0!"},{"$error":"#DIV/0!"},{"$error":"#DIV/0!"},{"$error":"#DIV/0!"},{"$f":"IF(A19=\"m\",VLOOKUP(P19,Berechnung_Male!$A$1:$D$42,AA19,TRUE),VLOOKUP(Eingabeblatt!P19,Berechnung_Female!$A$1:$D$42,AA19,TRUE))","v":{"$error":"#DIV/0!"}},{"$error":"#DIV/0!"},null,null,null,{"$error":"#DIV/0!"}]
[null,null,null,null,null,null,null,0,null,null,null,0,0,0,{"$error":"#DIV/0!"},{"$error":"#DIV/0!"},{"$error":"#DIV/0!"},{"$error":"#DIV/0!"},{"$error":"#DIV/0!"},{"$error":"#DIV/0!"},{"$error":"#DIV/0!"},{"$f":"IF(A20=\"m\",VLOOKUP(P20,Berechnung_Male!$A$1:$D$42,AA20,TRUE),VLOOKUP(Eingabeblatt!P20,Berechnung_Female!$A$1:$D$42,AA20,TRUE))","v":{"$error":"#DIV/0!"}},{"$error":"#DIV/0!"},null,null,null,{"$error":"#DIV/0!"}]
{"$rows_left_out":481}
{"sheet":"Ausgabeblatt","index":3,"n_rows":497,"n_cols":5,"rows_kept":497,"cut":false,"hidden":false,"merged":[]}
["Name\n\n\nNom","Vorname\n\n\nPrénom","Geburtsdatum\n\n\nDate de naissance","Messdatum\n\n\nDate de la mesure","Bio. Entwicklungsstand\nZahl (1-3)\n\nDéveloppement bio.\nCatégorie 1-3"]
[{"$f":"IF(Eingabeblatt!C5=\"\",\"\",Eingabeblatt!C5)","v":""},{"$f":"IF(Eingabeblatt!D5=\"\",\"\",Eingabeblatt!D5)","v":""},{"$f":"IF(Eingabeblatt!E5=\"\",\"\",Eingabeblatt!E5)","v":""},{"$f":"IF(Eingabeblatt!B5=\"\",\"\",Eingabeblatt!B5)","v":""},{"$f":"Eingabeblatt!R5","v":{"$error":"#DIV/0!"}}]
[{"$f":"IF(Eingabeblatt!C6=\"\",\"\",Eingabeblatt!C6)","v":""},{"$f":"IF(Eingabeblatt!D6=\"\",\"\",Eingabeblatt!D6)","v":""},{"$f":"IF(Eingabeblatt!E6=\"\",\"\",Eingabeblatt!E6)","v":""},{"$f":"IF(Eingabeblatt!B6=\"\",\"\",Eingabeblatt!B6)","v":""},{"$f":"Eingabeblatt!R6","v":{"$error":"#DIV/0!"}}]
[{"$f":"IF(Eingabeblatt!C7=\"\",\"\",Eingabeblatt!C7)","v":""},{"$f":"IF(Eingabeblatt!D7=\"\",\"\",Eingabeblatt!D7)","v":""},{"$f":"IF(Eingabeblatt!E7=\"\",\"\",Eingabeblatt!E7)","v":""},{"$f":"IF(Eingabeblatt!B7=\"\",\"\",Eingabeblatt!B7)","v":""},{"$f":"Eingabeblatt!R7","v":{"$error":"#DIV/0!"}}]
[{"$f":"IF(Eingabeblatt!C8=\"\",\"\",Eingabeblatt!C8)","v":""},{"$f":"IF(Eingabeblatt!D8=\"\",\"\",Eingabeblatt!D8)","v":""},{"$f":"IF(Eingabeblatt!E8=\"\",\"\",Eingabeblatt!E8)","v":""},{"$f":"IF(Eingabeblatt!B8=\"\",\"\",Eingabeblatt!B8)","v":""},{"$f":"Eingabeblatt!R8","v":{"$error":"#DIV/0!"}}]
[{"$f":"IF(Eingabeblatt!C9=\"\",\"\",Eingabeblatt!C9)","v":""},{"$f":"IF(Eingabeblatt!D9=\"\",\"\",Eingabeblatt!D9)","v":""},{"$f":"IF(Eingabeblatt!E9=\"\",\"\",Eingabeblatt!E9)","v":""},{"$f":"IF(Eingabeblatt!B9=\"\",\"\",Eingabeblatt!B9)","v":""},{"$f":"Eingabeblatt!R9","v":{"$error":"#DIV/0!"}}]
[{"$f":"IF(Eingabeblatt!C10=\"\",\"\",Eingabeblatt!C10)","v":""},{"$f":"IF(Eingabeblatt!D10=\"\",\"\",Eingabeblatt!D10)","v":""},{"$f":"IF(Eingabeblatt!E10=\"\",\"\",Eingabeblatt!E10)","v":""},{"$f":"IF(Eingabeblatt!B10=\"\",\"\",Eingabeblatt!B10)","v":""},{"$f":"Eingabeblatt!R10","v":{"$error":"#DIV/0!"}}]
[{"$f":"IF(Eingabeblatt!C11=\"\",\"\",Eingabeblatt!C11)","v":""},{"$f":"IF(Eingabeblatt!D11=\"\",\"\",Eingabeblatt!D11)","v":""},{"$f":"IF(Eingabeblatt!E11=\"\",\"\",Eingabeblatt!E11)","v":""},{"$f":"IF(Eingabeblatt!B11=\"\",\"\",Eingabeblatt!B11)","v":""},{"$f":"Eingabeblatt!R11","v":{"$error":"#DIV/0!"}}]
[{"$f":"IF(Eingabeblatt!C12=\"\",\"\",Eingabeblatt!C12)","v":""},{"$f":"IF(Eingabeblatt!D12=\"\",\"\",Eingabeblatt!D12)","v":""},{"$f":"IF(Eingabeblatt!E12=\"\",\"\",Eingabeblatt!E12)","v":""},{"$f":"IF(Eingabeblatt!B12=\"\",\"\",Eingabeblatt!B12)","v":""},{"$f":"Eingabeblatt!R12","v":{"$error":"#DIV/0!"}}]
[{"$f":"IF(Eingabeblatt!C13=\"\",\"\",Eingabeblatt!C13)","v":""},{"$f":"IF(Eingabeblatt!D13=\"\",\"\",Eingabeblatt!D13)","v":""},{"$f":"IF(Eingabeblatt!E13=\"\",\"\",Eingabeblatt!E13)","v":""},{"$f":"IF(Eingabeblatt!B13=\"\",\"\",Eingabeblatt!B13)","v":""},{"$f":"Eingabeblatt!R13","v":{"$error":"#DIV/0!"}}]
[{"$f":"IF(Eingabeblatt!C14=\"\",\"\",Eingabeblatt!C14)","v":""},{"$f":"IF(Eingabeblatt!D14=\"\",\"\",Eingabeblatt!D14)","v":""},{"$f":"IF(Eingabeblatt!E14=\"\",\"\",Eingabeblatt!E14)","v":""},{"$f":"IF(Eingabeblatt!B14=\"\",\"\",Eingabeblatt!B14)","v":""},{"$f":"Eingabeblatt!R14","v":{"$error":"#DIV/0!"}}]
[{"$f":"IF(Eingabeblatt!C15=\"\",\"\",Eingabeblatt!C15)","v":""},{"$f":"IF(Eingabeblatt!D15=\"\",\"\",Eingabeblatt!D15)","v":""},{"$f":"IF(Eingabeblatt!E15=\"\",\"\",Eingabeblatt!E15)","v":""},{"$f":"IF(Eingabeblatt!B15=\"\",\"\",Eingabeblatt!B15)","v":""},{"$f":"Eingabeblatt!R15","v":{"$error":"#DIV/0!"}}]
[{"$f":"IF(Eingabeblatt!C16=\"\",\"\",Eingabeblatt!C16)","v":""},{"$f":"IF(Eingabeblatt!D16=\"\",\"\",Eingabeblatt!D16)","v":""},{"$f":"IF(Eingabeblatt!E16=\"\",\"\",Eingabeblatt!E16)","v":""},{"$f":"IF(Eingabeblatt!B16=\"\",\"\",Eingabeblatt!B16)","v":""},{"$f":"Eingabeblatt!R16","v":{"$error":"#DIV/0!"}}]
[{"$f":"IF(Eingabeblatt!C17=\"\",\"\",Eingabeblatt!C17)","v":""},{"$f":"IF(Eingabeblatt!D17=\"\",\"\",Eingabeblatt!D17)","v":""},{"$f":"IF(Eingabeblatt!E17=\"\",\"\",Eingabeblatt!E17)","v":""},{"$f":"IF(Eingabeblatt!B17=\"\",\"\",Eingabeblatt!B17)","v":""},{"$f":"Eingabeblatt!R17","v":{"$error":"#DIV/0!"}}]
[{"$f":"IF(Eingabeblatt!C18=\"\",\"\",Eingabeblatt!C18)","v":""},{"$f":"IF(Eingabeblatt!D18=\"\",\"\",Eingabeblatt!D18)","v":""},{"$f":"IF(Eingabeblatt!E18=\"\",\"\",Eingabeblatt!E18)","v":""},{"$f":"IF(Eingabeblatt!B18=\"\",\"\",Eingabeblatt!B18)","v":""},{"$f":"Eingabeblatt!R18","v":{"$error":"#DIV/0!"}}]
[{"$f":"IF(Eingabeblatt!C19=\"\",\"\",Eingabeblatt!C19)","v":""},{"$f":"IF(Eingabeblatt!D19=\"\",\"\",Eingabeblatt!D19)","v":""},{"$f":"IF(Eingabeblatt!E19=\"\",\"\",Eingabeblatt!E19)","v":""},{"$f":"IF(Eingabeblatt!B19=\"\",\"\",Eingabeblatt!B19)","v":""},{"$f":"Eingabeblatt!R19","v":{"$error":"#DIV/0!"}}]
[{"$f":"IF(Eingabeblatt!C20=\"\",\"\",Eingabeblatt!C20)","v":""},{"$f":"IF(Eingabeblatt!D20=\"\",\"\",Eingabeblatt!D20)","v":""},{"$f":"IF(Eingabeblatt!E20=\"\",\"\",Eingabeblatt!E20)","v":""},{"$f":"IF(Eingabeblatt!B20=\"\",\"\",Eingabeblatt!B20)","v":""},{"$f":"Eingabeblatt!R20","v":{"$error":"#DIV/0!"}}]
[{"$f":"IF(Eingabeblatt!C21=\"\",\"\",Eingabeblatt!C21)","v":""},{"$f":"IF(Eingabeblatt!D21=\"\",\"\",Eingabeblatt!D21)","v":""},{"$f":"IF(Eingabeblatt!E21=\"\",\"\",Eingabeblatt!E21)","v":""},{"$f":"IF(Eingabeblatt!B21=\"\",\"\",Eingabeblatt!B21)","v":""},{"$f":"Eingabeblatt!R21","v":{"$error":"#DIV/0!"}}]
[{"$f":"IF(Eingabeblatt!C22=\"\",\"\",Eingabeblatt!C22)","v":""},{"$f":"IF(Eingabeblatt!D22=\"\",\"\",Eingabeblatt!D22)","v":""},{"$f":"IF(Eingabeblatt!E22=\"\",\"\",Eingabeblatt!E22)","v":""},{"$f":"IF(Eingabeblatt!B22=\"\",\"\",Eingabeblatt!B22)","v":""},{"$f":"Eingabeblatt!R22","v":{"$error":"#DIV/0!"}}]
[{"$f":"IF(Eingabeblatt!C23=\"\",\"\",Eingabeblatt!C23)","v":""},{"$f":"IF(Eingabeblatt!D23=\"\",\"\",Eingabeblatt!D23)","v":""},{"$f":"IF(Eingabeblatt!E23=\"\",\"\",Eingabeblatt!E23)","v":""},{"$f":"IF(Eingabeblatt!B23=\"\",\"\",Eingabeblatt!B23)","v":""},{"$f":"Eingabeblatt!R23","v":{"$error":"#DIV/0!"}}]
{"$rows_left_out":478}
{"sheet":"Berechnung_Male","index":4,"n_rows":55,"n_cols":6,"rows_kept":55,"cut":false,"hidden":true,"merged":[[51,0,51,2],[54,0,57,3]]}
["Year from PHV","early","average","late"]
[-4,45.29,40.090000000000003,34.729999999999997,null,"männlich"]
[-3.8,44.21,39.08,33.83]
[-3.6,43.11,38.07,32.94]
[-3.4,41.99,37.06,32.049999999999997]
[-3.2,40.85,36.049999999999997,31.16]
[-3,39.69,35.04,30.27]
[-2.8,38.520000000000003,34.04,29.38]
[-2.6,37.33,33.049999999999997,28.49]
[-2.4,36.15,32.06,27.6]
[-2.2000000000000002,34.97,31.07,26.7]
[-2,33.799999999999997,30.06,25.77]
[-1.8,32.619999999999997,29.03,24.79]
[-1.6,31.44,27.95,23.74]
[-1.4,30.23,26.83,22.63]
[-1.2,28.98,25.63,21.45]
[-1,27.66,24.36,20.22]
[-0.8,26.24,22.99,18.96]
[-0.6,24.68,21.51,17.68]
[-0.4,22.96,19.88,16.309999999999999]
{"$rows_left_out":36}
{"sheet":"Berechnung_Female","index":5,"n_rows":55,"n_cols":6,"rows_kept":55,"cut":false,"hidden":true,"merged":[[51,0,51,2],[54,0,57,3]]}
["Year from PHV","early","average","late"]
[-4,42.61,38.81,34.35,null,"weiblich"]
[-3.8,41.49,37.67,33.270000000000003]
[-3.6,40.39,36.549999999999997,32.200000000000003]
[-3.4,39.299999999999997,35.44,31.14]
[-3.2,38.21,34.340000000000003,30.09]
[-3,37.130000000000003,33.25,29.04]
[-2.8,36.04,32.159999999999997,27.99]
[-2.6,34.94,31.04,26.93]
[-2.4,33.82,29.91,25.87]
[-2.2000000000000002,32.68,28.76,24.79]
[-2,31.53,27.58,23.71]
[-1.8,30.44,26.39,22.63]
[-1.6,29.36,25.21,21.55]
[-1.4,28.24,24.03,20.47]
[-1.2,27.09,22.85,19.37]
[-1,25.87,21.66,18.25]
[-0.8,24.54,20.440000000000001,17.07]
[-0.6,23.09,19.16,15.81]
[-0.4,21.5,17.8,14.44]
{"$rows_left_out":35}